{"text_format":"1","workbook":"xlsx","n_sheets":7,"sheets":["Taul1","Lujuuskäyrä","Lujuus","K28","K7","K3","Betoniluokka"],"not_rendered":{"charts":3,"images":5,"macros":1,"external_links":0,"defined_names":21,"comments":0,"pivot_tables":0},"unopened":[{"sheet":"Lujuuskäyrä","index":1,"reason":"not_a_worksheet"},{"sheet":"Betoniluokka","index":6,"reason":"not_a_worksheet"}],"bounds":{"document_bytes":16777216,"sheet_cells":100000,"rows_first":2000,"rows_last":500,"rows_between":2000,"halvings":0,"cell_chars":16384,"cell_head_chars":4096},"cells_cut":0,"cells_raw":0,"read":"whole","date_system":"1900"}

{"sheet":"Taul1","index":0,"n_rows":54,"n_cols":13,"rows_kept":54,"cut":false,"hidden":false,"merged":[[6,0,6,2],[7,0,7,2],[9,0,9,1],[10,0,10,1],[11,0,11,1],[9,2,9,9],[17,3,17,4],[17,0,17,2],[15,0,15,3],[10,2,10,9],[11,2,11,9],[13,1,13,2],[14,6,15,7]]}
["Poista vanhat tiedot",null,null,null,"Aloita laskeminen",null,null,null,null,"Päiväys","1.5.2015","Kello",{"$f":"TIME(K2,K3,0)","v":"08:00:00"}]
["klikkaamalla tästä!",null,null,null,"klikkaamalla tästä!",null,null,null,null,"Tunnit",8]
[null,null,null,null,null,null,null,null,null,"Minuutit",0,null,2]
[null,null,null,null,null,null,null,null,null,"Lämpötila",18,null,3]
[]
[]
[]
["  Tekninen neuvonta",null,null,null,null,null,null,null,null,{"$f":"+NOW()","v":"2019-11-11T14:47:59.980"}]
[]
["  Kohde:",null,"As Oy Lujuushuippu"]
["  Rakennusosa:",null,"Väliseinä"]
["  Betonityönjohtaja:",null,"Taisto Terävä"]
[]
["  Betoni:",{"$f":"+Lujuus!C1","v":"C30/37"},null,"Laadunarvosteluikä (d)",null,{"$f":"CHOOSE(M3,28,7,3)","v":7}]
[null,null,null,null,null,null,"Kuutio-\nlujuusarvio ="]
["Kypsyysikä t20  =",null,null,null,{"$f":"+MAX(H21:H50)","v":0},"(d)",null,null,{"$f":"MAX(I21:I50)","v":0},"MPa"]
[]
["Mittaustulokset",null,null,"Aika valusta",null,"Keskilämpötila","Kypsyyslisä","Kypsyysikä","Lujuus-","Suunnittelu"]
["Päiväys","Kello","Lämpötila","tunteina","vuorokausina","aikavälillä","aikavälillä","t20","arvio","lujuudesta"]
["a","a","(C)","(h)","(d)","(C)","(d)","(d)","(MPa)","(%)"]
[null,null,null,0,0,"-----","----",0]
[null,null,null,{"$f":"IF(A22>0,+((A22-$A$21)+(B22-$B$21))*24,\"\")","v":""},{"$f":"+IF(A22>0,D22/24,\"\")","v":""},{"$f":"+IF(A22>0,(C22+C21)/2,\"\")","v":""},{"$f":"+IF(F22<-16,0,IF(A22>0,(F22+16)*(F22+16)/36/36*(E22-E21),\"\"))","v":""},{"$f":"+IF(A22>0,G22+H21,\"\")","v":""}]
[null,null,null,{"$f":"IF(A23>0,+((A23-$A$21)+(B23-$B$21))*24,\"\")","v":""},{"$f":"+IF(A23>0,D23/24,\"\")","v":""},{"$f":"+IF(A23>0,(C23+C22)/2,\"\")","v":""},{"$f":"+IF(F23<-16,0,IF(A23>0,(F23+16)*(F23+16)/36/36*(E23-E22),\"\"))","v":""},{"$f":"+IF(A23>0,G23+H22,\"\")","v":""}]
[null,null,null,"","","","",""]
[null,null,null,"","","","",""]
[null,null,null,"","","","",""]
[null,null,null,"","","","",""]
[null,null,null,"","","","",""]
[null,null,null,"","","","",""]
[null,null,null,"","","","",""]
{"$rows_left_out":25}
{"sheet":"Lujuus","index":2,"n_rows":90,"n_cols":13,"rows_kept":90,"cut":false,"hidden":true,"merged":[]}
[null,null,{"$f":"+CHOOSE(C2,E1,F1,G1,H1,I1,J1)","v":"C30/37"},null,"C40/50","C35/45","C30/37","C25/30","C20/25","C16/20"]
[null,{"$f":"+Taul1!$M$3","v":2},{"$f":"+Taul1!M4","v":3},null,50,45,37,30,25,20]
[{"$f":"+T20D","v":0},null,{"$f":"CHOOSE(C2,E2,F2,G2,H2,I2,J2)","v":37}]
["Kypsyys","Lujuussuhde","Lujuus",null,null,null,null,null,null,null,"Kypsyys","Lujuus","Loppulujuus"]
[0,0,{"$f":"+B5*$C$3","v":0},null,null,null,null,null,null,null,{"$f":"+Taul1!H21","v":0},{"$f":"+Taul1!I21","v":0},{"$f":"+Taul1!$I$16","v":0}]
[{"$f":"CHOOSE($B$2,'K28'!A5,'K7'!A5,'K3'!A5)","v":8.3333333333333329E-2},{"$f":"CHOOSE($B$2,'K28'!I5,'K7'!H5,'K3'!H5)","v":0},{"$f":"+B6*$C$3","v":0},null,null,null,null,null,null,null,{"$f":"+IF(Taul1!H22=\"\",0,Taul1!H22)","v":0},{"$f":"+Taul1!I22","v":0},{"$f":"+Taul1!$I$16","v":0}]
[{"$f":"CHOOSE($B$2,'K28'!A6,'K7'!A6,'K3'!A6)","v":0.16666666666666666},{"$f":"CHOOSE($B$2,'K28'!I6,'K7'!H6,'K3'!H6)","v":0},0,null,null,null,null,null,null,null,{"$f":"+IF(Taul1!H23=\"\",0,Taul1!H23)","v":0},{"$f":"+Taul1!I23","v":0},{"$f":"+Taul1!$I$16","v":0}]
[{"$f":"CHOOSE($B$2,'K28'!A7,'K7'!A7,'K3'!A7)","v":0.25},{"$f":"CHOOSE($B$2,'K28'!I7,'K7'!H7,'K3'!H7)","v":0},0,null,null,null,null,null,null,null,{"$f":"+IF(Taul1!H24=\"\",0,Taul1!H24)","v":0},{"$f":"+Taul1!I24","v":0},{"$f":"+Taul1!$I$16","v":0}]
[{"$f":"CHOOSE($B$2,'K28'!A8,'K7'!A8,'K3'!A8)","v":0.33333333333333331},{"$f":"CHOOSE($B$2,'K28'!I8,'K7'!H8,'K3'!H8)","v":3.1512271444560057E-2},1.1659540434487221,null,null,null,null,null,null,null,{"$f":"+IF(Taul1!H25=\"\",0,Taul1!H25)","v":0},{"$f":"+Taul1!I25","v":0},{"$f":"+Taul1!$I$16","v":0}]
[{"$f":"CHOOSE($B$2,'K28'!A9,'K7'!A9,'K3'!A9)","v":0.41666666666666669},{"$f":"CHOOSE($B$2,'K28'!I9,'K7'!H9,'K3'!H9)","v":0.10775154960784739},3.9868073354903535,null,null,null,null,null,null,null,{"$f":"+IF(Taul1!H26=\"\",0,Taul1!H26)","v":0},{"$f":"+Taul1!I26","v":0},{"$f":"+Taul1!$I$16","v":0}]
[{"$f":"CHOOSE($B$2,'K28'!A10,'K7'!A10,'K3'!A10)","v":0.5},{"$f":"CHOOSE($B$2,'K28'!I10,'K7'!H10,'K3'!H10)","v":0.17895799122590153},6.6214456753583564,null,null,null,null,null,null,null,{"$f":"+IF(Taul1!H27=\"\",0,Taul1!H27)","v":0},{"$f":"+Taul1!I27","v":0},{"$f":"+Taul1!$I$16","v":0}]
[{"$f":"CHOOSE($B$2,'K28'!A11,'K7'!A11,'K3'!A11)","v":0.58333333333333337},{"$f":"CHOOSE($B$2,'K28'!I11,'K7'!H11,'K3'!H11)","v":0.240274670616553},8.890162812812461,null,null,null,null,null,null,null,{"$f":"+IF(Taul1!H28=\"\",0,Taul1!H28)","v":0},{"$f":"+Taul1!I28","v":0},{"$f":"+Taul1!$I$16","v":0}]
[{"$f":"CHOOSE($B$2,'K28'!A12,'K7'!A12,'K3'!A12)","v":0.66666666666666663},{"$f":"CHOOSE($B$2,'K28'!I12,'K7'!H12,'K3'!H12)","v":0.2929763324895942},10.840124302114985,null,null,null,null,null,null,null,{"$f":"+IF(Taul1!H29=\"\",0,Taul1!H29)","v":0},{"$f":"+Taul1!I29","v":0},{"$f":"+Taul1!$I$16","v":0}]
[{"$f":"CHOOSE($B$2,'K28'!A13,'K7'!A13,'K3'!A13)","v":0.75},{"$f":"CHOOSE($B$2,'K28'!I13,'K7'!H13,'K3'!H13)","v":0.33873763669367163},12.533292557665851,null,null,null,null,null,null,null,{"$f":"+IF(Taul1!H30=\"\",0,Taul1!H30)","v":0},{"$f":"+Taul1!I30","v":0},{"$f":"+Taul1!$I$16","v":0}]
[{"$f":"CHOOSE($B$2,'K28'!A14,'K7'!A14,'K3'!A14)","v":0.83333333333333337},{"$f":"CHOOSE($B$2,'K28'!I14,'K7'!H14,'K3'!H14)","v":0.37893475046526787},14.020585767214911,null,null,null,null,null,null,null,{"$f":"+IF(Taul1!H31=\"\",0,Taul1!H31)","v":0},{"$f":"+Taul1!I31","v":0},{"$f":"+Taul1!$I$16","v":0}]
[{"$f":"CHOOSE($B$2,'K28'!A15,'K7'!A15,'K3'!A15)","v":0.91666666666666663},{"$f":"CHOOSE($B$2,'K28'!I15,'K7'!H15,'K3'!H15)","v":0.41462356242465898},15.341071809712382,null,null,null,null,null,null,null,{"$f":"+IF(Taul1!H32=\"\",0,Taul1!H32)","v":0},{"$f":"+Taul1!I32","v":0},{"$f":"+Taul1!$I$16","v":0}]
[{"$f":"CHOOSE($B$2,'K28'!A16,'K7'!A16,'K3'!A16)","v":1},{"$f":"CHOOSE($B$2,'K28'!I16,'K7'!H16,'K3'!H16)","v":0.44660904183250155},16.524534547802556,null,null,null,null,null,null,null,{"$f":"+IF(Taul1!H33=\"\",0,Taul1!H33)","v":0},{"$f":"+Taul1!I33","v":0},{"$f":"+Taul1!$I$16","v":0}]
[{"$f":"CHOOSE($B$2,'K28'!A17,'K7'!A17,'K3'!A17)","v":1.0833333333333333},{"$f":"CHOOSE($B$2,'K28'!I17,'K7'!H17,'K3'!H17)","v":0.47551079395113294},17.593899376191917,null,null,null,null,null,null,null,{"$f":"+IF(Taul1!H34=\"\",0,Taul1!H34)","v":0},{"$f":"+Taul1!I34","v":0},{"$f":"+Taul1!$I$16","v":0}]
[{"$f":"CHOOSE($B$2,'K28'!A18,'K7'!A18,'K3'!A18)","v":1.1666666666666667},{"$f":"CHOOSE($B$2,'K28'!I18,'K7'!H18,'K3'!H18)","v":0.50181242938846438},18.567059887373183,null,null,null,null,null,null,null,{"$f":"+IF(Taul1!H35=\"\",0,Taul1!H35)","v":0},{"$f":"+Taul1!I35","v":0},{"$f":"+Taul1!$I$16","v":0}]
[{"$f":"CHOOSE($B$2,'K28'!A19,'K7'!A19,'K3'!A19)","v":1.25},{"$f":"CHOOSE($B$2,'K28'!I19,'K7'!H19,'K3'!H19)","v":0.52589693254558934},19.458186504186806,null,null,null,null,null,null,null,{"$f":"+IF(Taul1!H36=\"\",0,Taul1!H36)","v":0},{"$f":"+Taul1!I36","v":0},{"$f":"+Taul1!$I$16","v":0}]
[{"$f":"CHOOSE($B$2,'K28'!A20,'K7'!A20,'K3'!A20)","v":1.3333333333333333},{"$f":"CHOOSE($B$2,'K28'!I20,'K7'!H20,'K3'!H20)","v":0.54807182981941105},20.27865770331821,null,null,null,null,null,null,null,{"$f":"+IF(Taul1!H37=\"\",0,Taul1!H37)","v":0},{"$f":"+Taul1!I37","v":0},{"$f":"+Taul1!$I$16","v":0}]
[{"$f":"CHOOSE($B$2,'K28'!A21,'K7'!A21,'K3'!A21)","v":1.4166666666666667},{"$f":"CHOOSE($B$2,'K28'!I21,'K7'!H21,'K3'!H21)","v":0.5685872350754273},21.03772769779081,null,null,null,null,null,null,null,{"$f":"+IF(Taul1!H38=\"\",0,Taul1!H38)","v":0},{"$f":"+Taul1!I38","v":0},{"$f":"+Taul1!$I$16","v":0}]
[{"$f":"CHOOSE($B$2,'K28'!A22,'K7'!A22,'K3'!A22)","v":1.5},{"$f":"CHOOSE($B$2,'K28'!I22,'K7'!H22,'K3'!H22)","v":0.58764895218915603},21.743011230998771,null,null,null,null,null,null,null,{"$f":"+IF(Taul1!H39=\"\",0,Taul1!H39)","v":0},{"$f":"+Taul1!I39","v":0},{"$f":"+Taul1!$I$16","v":0}]
[{"$f":"CHOOSE($B$2,'K28'!A23,'K7'!A23,'K3'!A23)","v":1.5833333333333333},{"$f":"CHOOSE($B$2,'K28'!I23,'K7'!H23,'K3'!H23)","v":0.60542812392711476},22.400840585303246,null,null,null,null,null,null,null,{"$f":"+IF(Taul1!H40=\"\",0,Taul1!H40)","v":0},{"$f":"+Taul1!I40","v":0},{"$f":"+Taul1!$I$16","v":0}]
[{"$f":"CHOOSE($B$2,'K28'!A24,'K7'!A24,'K3'!A24)","v":1.6666666666666667},{"$f":"CHOOSE($B$2,'K28'!I24,'K7'!H24,'K3'!H24)","v":0.62206843905512688},23.016532245039695,null,null,null,null,null,null,null,{"$f":"+IF(Taul1!H41=\"\",0,Taul1!H41)","v":0},{"$f":"+Taul1!I41","v":0},{"$f":"+Taul1!$I$16","v":0}]
[{"$f":"CHOOSE($B$2,'K28'!A25,'K7'!A25,'K3'!A25)","v":1.75},{"$f":"CHOOSE($B$2,'K28'!I25,'K7'!H25,'K3'!H25)","v":0.63769158951302041},23.594588811981755,null,null,null,null,null,null,null,{"$f":"+IF(Taul1!H42=\"\",0,Taul1!H42)","v":0},{"$f":"+Taul1!I42","v":0},{"$f":"+Taul1!$I$16","v":0}]
[{"$f":"CHOOSE($B$2,'K28'!A26,'K7'!A26,'K3'!A26)","v":1.8333333333333333},{"$f":"CHOOSE($B$2,'K28'!I26,'K7'!H26,'K3'!H26)","v":0.65240145594732413},24.138853870050994,null,null,null,null,null,null,null,{"$f":"+IF(Taul1!H43=\"\",0,Taul1!H43)","v":0},{"$f":"+Taul1!I43","v":0},{"$f":"+Taul1!$I$16","v":0}]
[{"$f":"CHOOSE($B$2,'K28'!A27,'K7'!A27,'K3'!A27)","v":1.9166666666666667},{"$f":"CHOOSE($B$2,'K28'!I27,'K7'!H27,'K3'!H27)","v":0.66628735657323235},24.652632193209598,null,null,null,null,null,null,null,{"$f":"+IF(Taul1!H44=\"\",0,Taul1!H44)","v":0},{"$f":"+Taul1!I44","v":0},{"$f":"+Taul1!$I$16","v":0}]
[{"$f":"CHOOSE($B$2,'K28'!A28,'K7'!A28,'K3'!A28)","v":2},{"$f":"CHOOSE($B$2,'K28'!I28,'K7'!H28,'K3'!H28)","v":0.67942659713958597},25.138784094164681,null,null,null,null,null,null,null,{"$f":"+IF(Taul1!H45=\"\",0,Taul1!H45)","v":0},{"$f":"+Taul1!I45","v":0},{"$f":"+Taul1!$I$16","v":0}]
[{"$f":"CHOOSE($B$2,'K28'!A29,'K7'!A29,'K3'!A29)","v":2.0833333333333335},{"$f":"CHOOSE($B$2,'K28'!I29,'K7'!H29,'K3'!H29)","v":0.69188649303316829},25.599800242227225,null,null,null,null,null,null,null,{"$f":"+IF(Taul1!H46=\"\",0,Taul1!H46)","v":0},{"$f":"+Taul1!I46","v":0},{"$f":"+Taul1!$I$16","v":0}]
{"$rows_left_out":61}
{"sheet":"K28","index":3,"n_rows":89,"n_cols":9,"rows_kept":89,"cut":false,"hidden":false,"merged":[]}
[null,null,null,null,null,null,null,null,{"$f":"+Taul1!M4","v":3}]
["Normaalisti kovettuva betoni","Suhteellinen lujuus (Kt/K28)"]
["Kypsyysikä (d)","C40/50","C35/45","C30/37","C25/30","C20/25","C16/20"]
[3.4720833333333335E-3,0,0,0,0,0,0,null,{"$f":"CHOOSE($I$1,B4,C4,D4,E4,F4,G4,H4)","v":0}]
[4.1666666666666664E-2,0,0,0,0,0,0,null,{"$f":"CHOOSE($I$1,B5,C5,D5,E5,F5,G5,H5)","v":0}]
[8.3333333333333329E-2,0,0,0,0,0,0,null,0]
[0.125,0,0,0,0,0,0,null,0]
[0.16666666666666666,0,0,0,0,0,0,null,0]
[0.20833333333333334,0,0,0,0,0,0,null,0]
[0.25,0,0,0,0,0,0,null,0]
[0.29166666666666669,6.5888178433641347E-4,2.0480670142234904E-6,0,0,0,0,null,0]
[0.33333333333333331,6.5207019209238713E-3,1.2872910210024937E-3,1.0527617789607988E-7,0,0,0,null,1.0527617789607988E-7]
[0.375,1.7601603276195966E-2,6.8456192728358961E-3,4.0191655549110347E-4,2.3478835989074458E-12,0,0,null,4.0191655549110347E-4]
[0.41666666666666669,3.1656893750023909E-2,1.6103928915378627E-2,2.973256165125459E-3,6.2563207854567221E-5,6.0179172474958713E-11,0,null,2.973256165125459E-3]
[0.45833333333333331,4.7167989394353363E-2,2.7678090622484375E-2,8.1736796506709092E-3,9.2992267214308524E-4,3.4767723484189503E-5,3.893992727530535E-21,null,8.1736796506709092E-3]
[0.5,6.3258991925068744E-2,4.0560658778665735E-2,1.5447278503962601E-2,3.3527144730181079E-3,5.3475877764518846E-4,4.0779251211230005E-6,null,1.5447278503962601E-2]
[0.54166666666666663,7.9433557632086746E-2,5.4108365186808664E-2,2.416944989360606E-2,7.3587465568467816E-3,2.0496276215515204E-3,1.5130097177070193E-4,null,2.416944989360606E-2]
[0.58333333333333337,9.5410866324177321E-2,6.7919547608998779E-2,3.3850175256585138E-2,1.2687224709690713E-2,4.7265969489493839E-3,7.9638568873046766E-4,null,3.3850175256585138E-2]
[0.625,0.11103392840643746,8.1743794929946573E-2,4.4135470137267464E-2,1.9040562365335741E-2,8.4725465409812607E-3,2.1742582510583391E-3,null,4.4135470137267464E-2]
[0.66666666666666663,0.12621830636137019,9.5425201515336761E-2,5.4775399758412127E-2,2.615921673057868E-2,1.311898586074986E-2,4.3381297320051167E-3,null,5.4775399758412127E-2]
[0.70833333333333337,0.14092279380261605,0.1088676070605355,6.5594383433107445E-2,3.3834691797686875E-2,1.8492631715154889E-2,7.2415792509028911E-3,null,6.5594383433107445E-2]
[0.75,0.1551322194824214,0.12201314978581945,7.6469071129291577E-2,4.1904587287778169E-2,2.4439403820093471E-2,1.0798613572828348E-2,null,7.6469071129291577E-2]
[0.79166666666666663,0.16884712481069791,0.13482881903623117,8.7312795985559272E-2,5.0243888078752942E-2,3.082989351653271E-2,1.4914047597708018E-2,null,8.7312795985559272E-2]
[0.83333333333333337,0.18207744489734401,0.14729787241710099,9.8064807786002697E-2,5.8756728794257439E-2,3.7558142465908939E-2,1.9496957099828745E-2,null,9.8064807786002697E-2]
[0.875,0.19483858066112145,0.15941426464528693,0.10868280985959877,6.7369642509280653E-2,4.4538399149843158E-2,2.446581809240268E-2,null,0.10868280985959877]
[0.91666666666666663,0.20714893098589363,0.17117897685017769,0.11913774862882251,7.6026305446484893E-2,5.1701616851976391E-2,2.9749799110332015E-2,null,0.11913774862882251]
[0.95833333333333337,0.2190283335751943,0.18259756724516199,0.12941014123198075,8.4683528195422908E-2,5.8992301276989186E-2,3.5288375091635613E-2,null,0.12941014123198075]
[1,0.23049708045635919,0.19367852007730799,0.1394874610441815,9.3308218041759011E-2,6.6365863898415201E-2,4.1030289807139957E-2,null,0.1394874610441815]
[1.0416666666666667,0.24157530159780646,0.2044321242809243,0.149362258010035,0.10187507745431194,7.3786468780636577E-2,4.6932341705945131E-2,null,0.149362258010035]
[1.0833333333333333,0.25228258664898046,0.21486970834582456,0.15903079483912841,0.11036485485716382,8.122530635148846E-2,5.2958202987336597E-2,null,0.15903079483912841]
{"$rows_left_out":60}
{"sheet":"K7","index":4,"n_rows":89,"n_cols":8,"rows_kept":89,"cut":false,"hidden":false,"merged":[]}
[null,null,null,null,null,null,null,{"$f":"+Taul1!M4","v":3}]
["Nopeasti kovettuva betoni","Suhteellinen lujuus (Kt/K7)"]
["Kypsyysikä (d)","C40/50","C35/45","C30/37","C25/30","C20/25","C16/20"]
[3.4720833333333335E-3,0,0,0,0,0,0,{"$f":"CHOOSE($H$1,B4,C4,D4,E4,F4,G4)","v":0}]
[8.3333333333333329E-2,0,0,0,0,0,0,{"$f":"CHOOSE($H$1,B5,C5,D5,E5,F5,G5)","v":0}]
[0.16666666666666666,0,0,0,0,0,0,0]
[0.25,2.4815905562458346E-2,3.9534170992444502E-3,0,0,0,0,0]
[0.33333333333333331,0.13399119419203789,9.0175026776919423E-2,3.1512271444560057E-2,2.8180288898719584E-3,7.4014237699537462E-11,0,3.1512271444560057E-2]
[0.41666666666666669,0.22601751057450478,0.17972404461071928,0.10775154960784739,5.0620623719791695E-2,1.9244177301325324E-2,2.461500439390178E-3,0.10775154960784739]
[0.5,0.29866236068145663,0.25318957950668158,0.17895799122590153,0.11324790143497489,6.9056718332830155E-2,3.2129052730643273E-2,0.17895799122590153]
[0.58333333333333337,0.35748194639571057,0.31364559916092383,0.240274670616553,0.17211297499784187,0.12282267340817708,7.6442435147656668E-2,0.240274670616553]
[0.66666666666666663,0.40639418807760191,0.36439001649725661,0.2929763324895942,0.22475234440443603,0.17351622976649125,0.12261502101826377,0.2929763324895942]
[0.75,0.44796787280443201,0.40779367004192413,0.33873763669367163,0.27152573110557049,0.21984294158490289,0.16685459061275887,0.33873763669367163]
[0.83333333333333337,0.48393017885072598,0.44551472324183566,0.37893475046526787,0.31325061098072327,0.2619062721463486,0.20815507447043075,0.37893475046526787]
[0.91666666666666663,0.51548427048077572,0.47873377564172631,0.41462356242465898,0.35071522237856062,0.30014422542056768,0.24640168066836857,0.41462356242465898]
[1,0.54349639714488751,0.50831280697717529,0.44660904183250155,0.38458586441177328,0.33503530008770882,0.28177150376751497,0.44660904183250155]
[1.0833333333333333,0.5686083762009434,0.53489678165011434,0.47551079395113294,0.41540657486392141,0.36701624585849046,0.31452551052022654,0.47551079395113294]
[1.1666666666666667,0.59130756198405465,0.55897906572592815,0.50181242938846438,0.4436185684793002,0.39646412229025707,0.34493290285355543,0.50181242938846438]
[1.25,0.61197189598805157,0.58094448306136537,0.52589693254558934,0.46958082448683142,0.42369827495983181,0.37324423072384533,0.52589693254558934]
[1.3333333333333333,0.63089984514709996,0.60109836936336536,0.54807182981941105,0.49358747118637292,0.44898780011354339,0.39968338359318628,0.54807182981941105]
[1.4166666666666667,0.64833086708356169,0.61968665847124782,0.5685872350754273,0.51588152012588151,0.47255969614689797,0.42444697051189884,0.5685872350754273]
[1.5,0.6644597538787147,0.63691008374479396,0.58764895218915603,0.53666548256627755,0.49460619645190396,0.44770644767184159,0.58764895218915603]
[1.5833333333333333,0.67944691041770533,0.65293442551316072,0.60542812392711476,0.5561095378652644,0.51529093491617106,0.46961107500742399,0.60542812392711476]
[1.6666666666666667,0.69342586582006993,0.66789804290503041,0.62206843905512688,0.57435783603452084,0.53475398923985873,0.49029091692578725,0.62206843905512688]
[1.75,0.70650885995108448,0.68191750252569328,0.63769158951302041,0.59153339108800951,0.5531159622284626,0.50985958751652338,0.63769158951302041]
[1.8333333333333333,0.71879106415368221,0.69509184857330053,0.65240145594732413,0.60774190985496646,0.57048127562472595,0.52841664979098779,0.65240145594732413]
[1.9166666666666667,0.73035381558567702,0.70750588673230741,0.66628735657323235,0.62307481289854072,0.5869408321957873,0.5460496665961766,0.66628735657323235]
[2,0.74126712764640079,0.7192327410920073,0.67942659713958597,0.63761163813457533,0.60257417503005206,0.56283593501271434,0.67942659713958597]
[2.0833333333333335,0.75159166133888267,0.7303358676423275,0.69188649303316829,0.65142196909853456,0.6174512473773599,0.57884394628004765,0.69188649303316829]
[2.1666666666666665,0.76138028985447603,0.74087065631800486,0.70372598813702425,0.66456699417513454,0.63163383461032507,0.59413461324873496,0.70372598813702425]
{"$rows_left_out":60}
{"sheet":"K3","index":5,"n_rows":89,"n_cols":8,"rows_kept":89,"cut":false,"hidden":false,"merged":[]}
[null,null,null,null,null,null,null,{"$f":"+Taul1!M4","v":3}]
["Erittäin nopeasti kovettuva betoni","Suhteellinen lujuus Kt/K3"]
["Kypsyysikä (d)","C40/50","C35/45","C30/37","C25/30","C20/25","C16/20"]
[3.4720833333333335E-3,0,0,0,0,0,0,{"$f":"CHOOSE($H$1,B4,C4,D4,E4,F4,G4)","v":0}]
[4.1666666666666664E-2,0,0,0,0,0,0,{"$f":"CHOOSE($H$1,B5,C5,D5,E5,F5,G5)","v":0}]
[8.3333333333333329E-2,0,0,0,0,0,0,0]
[0.125,0,0,0,0,0,0,0]
[0.16666666666666666,0,0,0,0,0,0,0]
[0.20833333333333334,2.5771751951207955E-2,1.2047506592376482E-5,0,0,0,0,0]
[0.25,0.15281510933355819,8.8157587382000621E-2,3.6258509871298977E-3,0,0,0,3.6258509871298977E-3]
[0.29166666666666669,0.2544595641327998,0.19332005358142693,8.2992121754406067E-2,7.4248358067213202E-3,0,0,8.2992121754406067E-2]
[0.33333333333333331,0.33223287329884255,0.27645563794361727,0.17021827536152104,7.2924567285127084E-2,1.7438030360711055E-2,3.7355684903134274E-8,0.17021827536152104]
[0.375,0.39399578076547931,0.34295847559665316,0.24382406885032953,0.14648709622036624,7.7616427873904548E-2,2.0833916268671159E-2,0.24382406885032953]
[0.41666666666666669,0.44467251637021155,0.39765248198611231,0.30540410534761803,0.21215586111895351,0.14174054998766242,7.2789946336745875E-2,0.30540410534761803]
[0.45833333333333331,0.48732098789367689,0.44372631375917387,0.35766927524733977,0.26929229522054743,0.20053185100133231,0.12894284318653593,0.35766927524733977]
[0.5,0.52392984709878754,0.48329553770514494,0.40273777916285802,0.31917257678388294,0.2530411725488419,0.1820712488283022,0.40273777916285802]
[0.54166666666666663,0.55585267106177894,0.51781162160290339,0.44215139743290488,0.36311058554359249,0.2998659913885246,0.23076765663939286,0.44215139743290488]
[0.58333333333333337,0.58404728232921388,0.54830526695156667,0.47703526857008044,0.40218449761764152,0.34182314115492957,0.27508855391427256,0.47703526857008044]
[0.625,0.60921379604872672,0.57553107291978456,0.5082251303254105,0.43724053375585831,0.37965954545933428,0.31545702124574332,0.5082251303254105]
[0.66666666666666663,0.63187803454685709,0.6000561958507532,0.53635442122506782,0.46893988879753751,0.41400122668253581,0.3523511479172543,0.53635442122506782]
[0.70833333333333337,0.65244407395747139,0.62231660798929012,0.56191261856454344,0.49780308220936864,0.44536049452631737,0.3862135640159286,0.56191261856454344]
[0.75,0.67122856821233112,0.64265399112229193,0.58528466360892029,0.52424450916704035,0.4741550814848125,0.41742965177138486,0.58528466360892029]
[0.79166666666666663,0.68848388560019369,0.66134065931968811,0.60677808319368742,0.5485980594975155,0.50072696736690969,0.44632771538398097,0.60677808319368742]
[0.83333333333333337,0.70441413617947579,0.67859684428808187,0.62664202060395724,0.57113591840232159,0.52535807448569904,0.47318561053655167,0.62664202060395724]
[0.875,0.71918654282876593,0.69460296660252085,0.64508085185366781,0.5920824144575112,0.5482826805773392,0.49823853201022483,0.64508085185366781]
[0.91666666666666663,0.73293968008889065,0.70950852940204845,0.6622641078044863,0.61162431355441527,0.5696970652125215,0.52168621360524414,0.6622641078044863]
[0.95833333333333337,0.74578955576542338,0.72343868403056355,0.67833382743006754,0.62991855727601942,0.58976698132426619,0.54369907309005749,0.67833382743006754]
[1,0.75783417526608288,0.73649915756979378,0.69341009215132843,0.6470981489578207,0.60863345991887297,0.56442328773025774,0.69341009215132843]
[1.0416666666666667,0.76915701856119034,0.74878000615864471,0.70759525035539483,0.6632766830477288,0.62641734715874908,0.58398493028685317,0.70759525035539483]
[1.0833333333333333,0.77982972458103295,0.76035851241152697,0.72097718390338084,0.67855186945154888,0.6432228769641839,0.60249332472613459,0.72097718390338084]
{"$rows_left_out":59}